{"text_format":"1","workbook":"xlsx","n_sheets":5,"sheets":["Efficiency","Purity","Sequencing","Products","排序"],"not_rendered":{"charts":0,"images":0,"macros":1,"external_links":0,"defined_names":0,"comments":0,"pivot_tables":0},"unopened":[],"bounds":{"document_bytes":16777216,"sheet_cells":100000,"rows_first":2000,"rows_last":500,"rows_between":2000,"halvings":0,"cell_chars":16384,"cell_head_chars":4096},"cells_cut":0,"cells_raw":0,"read":"whole","date_system":"1900"}

{"sheet":"Efficiency","index":0,"n_rows":12,"n_cols":10,"rows_kept":12,"cut":false,"hidden":false,"merged":[]}
["Efficiency(%)","T","G","C","T+G",null,"Efficiency(%)","T","G","T+G"]
["C3",{"$f":"VLOOKUP(Efficiency!$A$2,Sequencing!$A$8:$H$28,2,FALSE)","v":{"$error":"#N/A"}},0,99.9,{"$f":"SUM(C2+B2)","v":{"$error":"#N/A"}},null,"C3",{"$f":"B2","v":{"$error":"#N/A"}},{"$f":"C2","v":0},{"$f":"SUM(H2:I2)","v":{"$error":"#N/A"}}]
["A4",0,86,0.1,{"$f":"SUM(C3+B3)","v":86},null,"A4",{"$f":"B3","v":0},{"$f":"C3","v":86},{"$f":"SUM(H3:I3)","v":86}]
["C5",0,0.1,99.9,{"$f":"SUM(C4+B4)","v":0.1},null,"C5",0,0.1,0.1]
["C6",0.4,0.5,99,0.9,null,"C6",0.4,0.5,0.9]
["C8",0,0.2,99.8,0.2,null,"C8",0,0.2,0.2]
["C9",0,0,99.9,0,null,"C9",0,0,0]
["A10",0,5.6,0,5.6,null,"A10",0,5.6,5.6]
["A11",0,4,0,4,null,"A11",0,4,4]
["A14",0,0.1,0,0.1,null,"A14",0,0.1,0.1]
["C15",0,0,99.8,0,null,"C15",0,0,0]
["A17",0.1,0.1,0.4,0.2,null,"A17",0.1,0.1,0.2]

{"sheet":"Purity","index":1,"n_rows":17,"n_cols":11,"rows_kept":17,"cut":false,"hidden":false,"merged":[[1,6,6,6],[11,6,16,6]]}
["Efficiency(%)","T","G","C","T+G",null,"43bp-indels(%)","Purity(%)","T","G","T+G"]
["C3",0,0,99.9,0,null,{"$f":"(G9+H9)/F9*100","v":0.28789585680310426},"C3",{"$f":"B2/(100-$D2)*100","v":0},{"$f":"C2/(100-$D2)*100","v":0},{"$f":"SUM(I2+J2)","v":0}]
["C5",0,0.1,99.9,0.1,null,null,"C5",{"$f":"B3/(100-$D3)*100","v":0},{"$f":"C3/(100-$D3)*100","v":100.00000000000568},{"$f":"SUM(I3+J3)","v":100.00000000000568}]
["C6",0.4,0.5,99,0.9,null,null,"C6",40,50,90]
["C8",0,0.2,99.8,0.2,null,null,"C8",0,99.999999999998579,99.999999999998579]
["C9",0,0,99.9,0,null,null,"C9",0,0,0]
["C15",0,0,99.8,0,null,null,"C15",0,0,0]
[null,null,null,null,null,"With both indicator sequences","Insertions","Deletions"]
[null,null,null,null,null,7989,5,18]
[]
[null,null,null,null,null,null,"all-indels(%)","Purity(%)","T","G","T+G"]
[null,null,null,null,null,null,{"$f":"($G$9+$H$9)/$F$9*100","v":0.28789585680310426},"C3",{"$f":"B2/(100-$D2)*100","v":0},{"$f":"C2/(100-$D2)*100","v":0},{"$f":"SUM(I12+J12)","v":0}]
[null,null,null,null,null,null,null,"C5",{"$f":"B3/(100-$D3)*100","v":0},{"$f":"C3/(100-$D3)*100","v":100.00000000000568},{"$f":"SUM(I13+J13)","v":100.00000000000568}]
[null,null,null,null,null,null,null,"C6",40,50,90]
[null,null,null,null,null,null,null,"C8",0,99.999999999998579,99.999999999998579]
[null,null,null,null,null,null,null,"C9",0,0,0]
[null,null,null,null,null,null,null,"C15",0,0,0]

{"sheet":"Sequencing","index":2,"n_rows":38,"n_cols":99,"rows_kept":38,"cut":false,"hidden":false,"merged":[[29,0,29,2],[29,3,29,5],[11,16,11,19],[12,16,12,19],[13,16,13,19],[16,16,16,19],[14,16,14,19],[15,16,15,19],[25,16,25,18],[36,0,36,2],[36,3,36,5],[36,6,36,8],[36,9,36,11],[36,12,36,14],[36,15,36,17],[36,18,36,20],[36,21,36,23],[36,24,36,26],[36,27,36,29],[36,30,36,32],[36,33,36,35],[36,36,36,38],[36,39,36,41],[36,42,36,44],[36,57,36,59],[36,45,36,47],[36,48,36,50],[36,51,36,53],[36,54,36,56]]}
[null,"G","T","G","C","C","C","A","G","A","C","T","G","A","G","C","A","C","G","T","G","A"]
["A",0,0,0,0,0,0,0,0,0,0,0.2,1,13.3,0,14.5,0,0,0.1,94.1,0.1,0]
["T",99.8,0,0,99.9,99.9,0,0,0,0,0,2,2.6,0.1,0.1,0,0,100,0,0,0,0.1]
["G",0,0,0,0,0,100,100,100,100,0,1.4,1.1000000000000001,86.5,99.9,85.5,0,0,99.9,5.9,99.9,0]
["C",0.2,100,100,0.1,0,0,0,0,0,100,96.3,95.3,0.1,0,0,100,0,0,0,0,99.9]
[]
[null,"T","G","C",null,"T","G","C","T+G",null,"T","G","C","T+G"]
[{"$f":"TEXT(\"A\"&(IF(SMALL(IF($B$1:$V$1=\"A\",COLUMN($B$1:$V$1)),ROW(A1))=2,\"-1\",SMALL(IF($B$1:$V$1=\"A\",COLUMN($B$1:$V$1)),ROW(A1))-2)),\"000\")","v":"A6"},{"$f":"INDEX($A$1:$V$5,3,SMALL(IF($B$1:$V$1=\"A\",COLUMN($B$1:$V$1)),ROW(B1)))","v":0},{"$f":"INDEX($A$1:$V$5,4,SMALL(IF($B$1:$V$1=\"A\",COLUMN($B$1:$V$1)),ROW(C1)))","v":100},{"$f":"INDEX($A$1:$V$5,5,SMALL(IF($B$1:$V$1=\"A\",COLUMN($B$1:$V$1)),ROW(D1)))","v":0},{"$f":"TEXT(\"C\"&(IF(SMALL(IF($B$1:$V$1=\"C\",COLUMN($B$1:$V$1)),ROW(E1))=2,\"-1\",SMALL(IF($B$1:$V$1=\"C\",COLUMN($B$1:$V$1)),ROW(E1))-2)),\"000\")","v":"C3"},{"$f":"INDEX($A$1:$V$5,3,SMALL(IF($B$1:$V$1=\"C\",COLUMN($B$1:$V$1)),ROW(E1)))","v":99.9},{"$f":"INDEX($A$1:$V$5,4,SMALL(IF($B$1:$V$1=\"C\",COLUMN($B$1:$V$1)),ROW(F1)))","v":0},{"$f":"INDEX($A$1:$V$5,5,SMALL(IF($B$1:$V$1=\"C\",COLUMN($B$1:$V$1)),ROW(G1)))","v":0.1},{"$f":"F8+G8","v":99.9},{"$f":"排序!B2","v":"C3"},{"$f":"排序!C2","v":99.9},{"$f":"排序!D2","v":0},{"$f":"排序!E2","v":0.1},{"$f":"K8+L8","v":99.9}]
[{"$f":"TEXT(\"A\"&(IF(SMALL(IF($B$1:$V$1=\"A\",COLUMN($B$1:$V$1)),ROW(A2))=2,\"-1\",SMALL(IF($B$1:$V$1=\"A\",COLUMN($B$1:$V$1)),ROW(A2))-2)),\"000\")","v":"A8"},{"$f":"INDEX($A$1:$V$5,3,SMALL(IF($B$1:$V$1=\"A\",COLUMN($B$1:$V$1)),ROW(B2)))","v":0},{"$f":"INDEX($A$1:$V$5,4,SMALL(IF($B$1:$V$1=\"A\",COLUMN($B$1:$V$1)),ROW(C2)))","v":100},{"$f":"INDEX($A$1:$V$5,5,SMALL(IF($B$1:$V$1=\"A\",COLUMN($B$1:$V$1)),ROW(D2)))","v":0},{"$f":"TEXT(\"C\"&(IF(SMALL(IF($B$1:$V$1=\"C\",COLUMN($B$1:$V$1)),ROW(E2))=2,\"-1\",SMALL(IF($B$1:$V$1=\"C\",COLUMN($B$1:$V$1)),ROW(E2))-2)),\"000\")","v":"C4"},{"$f":"INDEX($A$1:$V$5,3,SMALL(IF($B$1:$V$1=\"C\",COLUMN($B$1:$V$1)),ROW(E2)))","v":99.9},{"$f":"INDEX($A$1:$V$5,4,SMALL(IF($B$1:$V$1=\"C\",COLUMN($B$1:$V$1)),ROW(F2)))","v":0},{"$f":"INDEX($A$1:$V$5,5,SMALL(IF($B$1:$V$1=\"C\",COLUMN($B$1:$V$1)),ROW(G2)))","v":0},{"$f":"F9+G9","v":99.9},{"$f":"排序!B3","v":"C4"},{"$f":"排序!C3","v":99.9},{"$f":"排序!D3","v":0},{"$f":"排序!E3","v":0},{"$f":"K9+L9","v":99.9}]
[{"$f":"TEXT(\"A\"&(IF(SMALL(IF($B$1:$V$1=\"A\",COLUMN($B$1:$V$1)),ROW(A3))=2,\"-1\",SMALL(IF($B$1:$V$1=\"A\",COLUMN($B$1:$V$1)),ROW(A3))-2)),\"000\")","v":"A12"},{"$f":"INDEX($A$1:$V$5,3,SMALL(IF($B$1:$V$1=\"A\",COLUMN($B$1:$V$1)),ROW(B3)))","v":0.1},{"$f":"INDEX($A$1:$V$5,4,SMALL(IF($B$1:$V$1=\"A\",COLUMN($B$1:$V$1)),ROW(C3)))","v":86.5},{"$f":"INDEX($A$1:$V$5,5,SMALL(IF($B$1:$V$1=\"A\",COLUMN($B$1:$V$1)),ROW(D3)))","v":0.1},{"$f":"TEXT(\"C\"&(IF(SMALL(IF($B$1:$V$1=\"C\",COLUMN($B$1:$V$1)),ROW(E3))=2,\"-1\",SMALL(IF($B$1:$V$1=\"C\",COLUMN($B$1:$V$1)),ROW(E3))-2)),\"000\")","v":"C5"},{"$f":"INDEX($A$1:$V$5,3,SMALL(IF($B$1:$V$1=\"C\",COLUMN($B$1:$V$1)),ROW(E3)))","v":0},{"$f":"INDEX($A$1:$V$5,4,SMALL(IF($B$1:$V$1=\"C\",COLUMN($B$1:$V$1)),ROW(F3)))","v":100},{"$f":"INDEX($A$1:$V$5,5,SMALL(IF($B$1:$V$1=\"C\",COLUMN($B$1:$V$1)),ROW(G3)))","v":0},100,{"$f":"排序!B4","v":"C5"},{"$f":"排序!C4","v":0},{"$f":"排序!D4","v":100},{"$f":"排序!E4","v":0},100]
[{"$f":"TEXT(\"A\"&(IF(SMALL(IF($B$1:$V$1=\"A\",COLUMN($B$1:$V$1)),ROW(A4))=2,\"-1\",SMALL(IF($B$1:$V$1=\"A\",COLUMN($B$1:$V$1)),ROW(A4))-2)),\"000\")","v":"A15"},{"$f":"INDEX($A$1:$V$5,3,SMALL(IF($B$1:$V$1=\"A\",COLUMN($B$1:$V$1)),ROW(B4)))","v":0},{"$f":"INDEX($A$1:$V$5,4,SMALL(IF($B$1:$V$1=\"A\",COLUMN($B$1:$V$1)),ROW(C4)))","v":0},{"$f":"INDEX($A$1:$V$5,5,SMALL(IF($B$1:$V$1=\"A\",COLUMN($B$1:$V$1)),ROW(D4)))","v":100},{"$f":"TEXT(\"C\"&(IF(SMALL(IF($B$1:$V$1=\"C\",COLUMN($B$1:$V$1)),ROW(E4))=2,\"-1\",SMALL(IF($B$1:$V$1=\"C\",COLUMN($B$1:$V$1)),ROW(E4))-2)),\"000\")","v":"C9"},{"$f":"INDEX($A$1:$V$5,3,SMALL(IF($B$1:$V$1=\"C\",COLUMN($B$1:$V$1)),ROW(E4)))","v":0},{"$f":"INDEX($A$1:$V$5,4,SMALL(IF($B$1:$V$1=\"C\",COLUMN($B$1:$V$1)),ROW(F4)))","v":0},{"$f":"INDEX($A$1:$V$5,5,SMALL(IF($B$1:$V$1=\"C\",COLUMN($B$1:$V$1)),ROW(G4)))","v":100},0,{"$f":"排序!B5","v":"A6"},{"$f":"排序!C5","v":0},{"$f":"排序!D5","v":100},{"$f":"排序!E5","v":0},100]
[{"$f":"TEXT(\"A\"&(IF(SMALL(IF($B$1:$V$1=\"A\",COLUMN($B$1:$V$1)),ROW(A5))=2,\"-1\",SMALL(IF($B$1:$V$1=\"A\",COLUMN($B$1:$V$1)),ROW(A5))-2)),\"000\")","v":"A20"},{"$f":"INDEX($A$1:$V$5,3,SMALL(IF($B$1:$V$1=\"A\",COLUMN($B$1:$V$1)),ROW(B5)))","v":0.1},{"$f":"INDEX($A$1:$V$5,4,SMALL(IF($B$1:$V$1=\"A\",COLUMN($B$1:$V$1)),ROW(C5)))","v":0},{"$f":"INDEX($A$1:$V$5,5,SMALL(IF($B$1:$V$1=\"A\",COLUMN($B$1:$V$1)),ROW(D5)))","v":99.9},{"$f":"TEXT(\"C\"&(IF(SMALL(IF($B$1:$V$1=\"C\",COLUMN($B$1:$V$1)),ROW(E5))=2,\"-1\",SMALL(IF($B$1:$V$1=\"C\",COLUMN($B$1:$V$1)),ROW(E5))-2)),\"000\")","v":"C14"},{"$f":"INDEX($A$1:$V$5,3,SMALL(IF($B$1:$V$1=\"C\",COLUMN($B$1:$V$1)),ROW(E5)))","v":0},{"$f":"INDEX($A$1:$V$5,4,SMALL(IF($B$1:$V$1=\"C\",COLUMN($B$1:$V$1)),ROW(F5)))","v":85.5},{"$f":"INDEX($A$1:$V$5,5,SMALL(IF($B$1:$V$1=\"C\",COLUMN($B$1:$V$1)),ROW(G5)))","v":0},85.5,{"$f":"排序!B6","v":"A8"},{"$f":"排序!C6","v":0},{"$f":"排序!D6","v":100},{"$f":"排序!E6","v":0},100,null,null,"操作指南："]
[{"$f":"TEXT(\"A\"&(IF(SMALL(IF($B$1:$V$1=\"A\",COLUMN($B$1:$V$1)),ROW(A6))=2,\"-1\",SMALL(IF($B$1:$V$1=\"A\",COLUMN($B$1:$V$1)),ROW(A6))-2)),\"000\")","v":{"$error":"#NUM!"}},{"$f":"INDEX($A$1:$V$5,3,SMALL(IF($B$1:$V$1=\"A\",COLUMN($B$1:$V$1)),ROW(B6)))","v":{"$error":"#NUM!"}},{"$f":"INDEX($A$1:$V$5,4,SMALL(IF($B$1:$V$1=\"A\",COLUMN($B$1:$V$1)),ROW(C6)))","v":{"$error":"#NUM!"}},{"$f":"INDEX($A$1:$V$5,5,SMALL(IF($B$1:$V$1=\"A\",COLUMN($B$1:$V$1)),ROW(D6)))","v":{"$error":"#NUM!"}},{"$f":"TEXT(\"C\"&(IF(SMALL(IF($B$1:$V$1=\"C\",COLUMN($B$1:$V$1)),ROW(E6))=2,\"-1\",SMALL(IF($B$1:$V$1=\"C\",COLUMN($B$1:$V$1)),ROW(E6))-2)),\"000\")","v":"C16"},{"$f":"INDEX($A$1:$V$5,3,SMALL(IF($B$1:$V$1=\"C\",COLUMN($B$1:$V$1)),ROW(E6)))","v":100},{"$f":"INDEX($A$1:$V$5,4,SMALL(IF($B$1:$V$1=\"C\",COLUMN($B$1:$V$1)),ROW(F6)))","v":0},{"$f":"INDEX($A$1:$V$5,5,SMALL(IF($B$1:$V$1=\"C\",COLUMN($B$1:$V$1)),ROW(G6)))","v":0},100,{"$f":"排序!B7","v":"C9"},{"$f":"排序!C7","v":0},{"$f":"排序!D7","v":0},{"$f":"排序!E7","v":100},0,null,null,"1、将序列复制到下方操作区"]
[{"$f":"TEXT(\"A\"&(IF(SMALL(IF($B$1:$V$1=\"A\",COLUMN($B$1:$V$1)),ROW(A7))=2,\"-1\",SMALL(IF($B$1:$V$1=\"A\",COLUMN($B$1:$V$1)),ROW(A7))-2)),\"000\")","v":{"$error":"#NUM!"}},{"$f":"INDEX($A$1:$V$5,3,SMALL(IF($B$1:$V$1=\"A\",COLUMN($B$1:$V$1)),ROW(B7)))","v":{"$error":"#NUM!"}},{"$f":"INDEX($A$1:$V$5,4,SMALL(IF($B$1:$V$1=\"A\",COLUMN($B$1:$V$1)),ROW(C7)))","v":{"$error":"#NUM!"}},{"$f":"INDEX($A$1:$V$5,5,SMALL(IF($B$1:$V$1=\"A\",COLUMN($B$1:$V$1)),ROW(D7)))","v":{"$error":"#NUM!"}},{"$f":"TEXT(\"C\"&(IF(SMALL(IF($B$1:$V$1=\"C\",COLUMN($B$1:$V$1)),ROW(E7))=2,\"-1\",SMALL(IF($B$1:$V$1=\"C\",COLUMN($B$1:$V$1)),ROW(E7))-2)),\"000\")","v":{"$error":"#NUM!"}},{"$f":"INDEX($A$1:$V$5,3,SMALL(IF($B$1:$V$1=\"C\",COLUMN($B$1:$V$1)),ROW(E7)))","v":{"$error":"#NUM!"}},{"$f":"INDEX($A$1:$V$5,4,SMALL(IF($B$1:$V$1=\"C\",COLUMN($B$1:$V$1)),ROW(F7)))","v":{"$error":"#NUM!"}},{"$f":"INDEX($A$1:$V$5,5,SMALL(IF($B$1:$V$1=\"C\",COLUMN($B$1:$V$1)),ROW(G7)))","v":{"$error":"#NUM!"}},{"$error":"#NUM!"},{"$f":"排序!B8","v":"A12"},{"$f":"排序!C8","v":0.1},{"$f":"排序!D8","v":86.5},{"$f":"排序!E8","v":0.1},86.6,null,null,"2、将靶向序列复制到靶向序列区（注意对齐）"]
[{"$f":"TEXT(\"A\"&(IF(SMALL(IF($B$1:$V$1=\"A\",COLUMN($B$1:$V$1)),ROW(A8))=2,\"-1\",SMALL(IF($B$1:$V$1=\"A\",COLUMN($B$1:$V$1)),ROW(A8))-2)),\"000\")","v":{"$error":"#NUM!"}},{"$f":"INDEX($A$1:$V$5,3,SMALL(IF($B$1:$V$1=\"A\",COLUMN($B$1:$V$1)),ROW(B8)))","v":{"$error":"#NUM!"}},{"$f":"INDEX($A$1:$V$5,4,SMALL(IF($B$1:$V$1=\"A\",COLUMN($B$1:$V$1)),ROW(C8)))","v":{"$error":"#NUM!"}},{"$f":"INDEX($A$1:$V$5,5,SMALL(IF($B$1:$V$1=\"A\",COLUMN($B$1:$V$1)),ROW(D8)))","v":{"$error":"#NUM!"}},{"$f":"TEXT(\"C\"&(IF(SMALL(IF($B$1:$V$1=\"C\",COLUMN($B$1:$V$1)),ROW(E8))=2,\"-1\",SMALL(IF($B$1:$V$1=\"C\",COLUMN($B$1:$V$1)),ROW(E8))-2)),\"000\")","v":{"$error":"#NUM!"}},{"$f":"INDEX($A$1:$V$5,3,SMALL(IF($B$1:$V$1=\"C\",COLUMN($B$1:$V$1)),ROW(E8)))","v":{"$error":"#NUM!"}},{"$f":"INDEX($A$1:$V$5,4,SMALL(IF($B$1:$V$1=\"C\",COLUMN($B$1:$V$1)),ROW(F8)))","v":{"$error":"#NUM!"}},{"$f":"INDEX($A$1:$V$5,5,SMALL(IF($B$1:$V$1=\"C\",COLUMN($B$1:$V$1)),ROW(G8)))","v":{"$error":"#NUM!"}},{"$error":"#NUM!"},{"$f":"排序!B9","v":"C14"},{"$f":"排序!C9","v":0},{"$f":"排序!D9","v":85.5},{"$f":"排序!E9","v":0},85.5,null,null,"3、根据孔位选择填充空位（下拉）"]
[{"$f":"TEXT(\"A\"&(IF(SMALL(IF($B$1:$V$1=\"A\",COLUMN($B$1:$V$1)),ROW(A9))=2,\"-1\",SMALL(IF($B$1:$V$1=\"A\",COLUMN($B$1:$V$1)),ROW(A9))-2)),\"000\")","v":{"$error":"#NUM!"}},{"$f":"INDEX($A$1:$V$5,3,SMALL(IF($B$1:$V$1=\"A\",COLUMN($B$1:$V$1)),ROW(B9)))","v":{"$error":"#NUM!"}},{"$f":"INDEX($A$1:$V$5,4,SMALL(IF($B$1:$V$1=\"A\",COLUMN($B$1:$V$1)),ROW(C9)))","v":{"$error":"#NUM!"}},{"$f":"INDEX($A$1:$V$5,5,SMALL(IF($B$1:$V$1=\"A\",COLUMN($B$1:$V$1)),ROW(D9)))","v":{"$error":"#NUM!"}},{"$f":"TEXT(\"C\"&(IF(SMALL(IF($B$1:$V$1=\"C\",COLUMN($B$1:$V$1)),ROW(E9))=2,\"-1\",SMALL(IF($B$1:$V$1=\"C\",COLUMN($B$1:$V$1)),ROW(E9))-2)),\"000\")","v":{"$error":"#NUM!"}},{"$f":"INDEX($A$1:$V$5,3,SMALL(IF($B$1:$V$1=\"C\",COLUMN($B$1:$V$1)),ROW(E9)))","v":{"$error":"#NUM!"}},{"$f":"INDEX($A$1:$V$5,4,SMALL(IF($B$1:$V$1=\"C\",COLUMN($B$1:$V$1)),ROW(F9)))","v":{"$error":"#NUM!"}},{"$f":"INDEX($A$1:$V$5,5,SMALL(IF($B$1:$V$1=\"C\",COLUMN($B$1:$V$1)),ROW(G9)))","v":{"$error":"#NUM!"}},{"$error":"#NUM!"},{"$f":"排序!B10","v":"A15"},{"$f":"排序!C10","v":0},{"$f":"排序!D10","v":0},{"$f":"排序!E10","v":100},0,null,null,"4、点击Done"]
[{"$f":"TEXT(\"A\"&(IF(SMALL(IF($B$1:$V$1=\"A\",COLUMN($B$1:$V$1)),ROW(A10))=2,\"-1\",SMALL(IF($B$1:$V$1=\"A\",COLUMN($B$1:$V$1)),ROW(A10))-2)),\"000\")","v":{"$error":"#NUM!"}},{"$f":"INDEX($A$1:$V$5,3,SMALL(IF($B$1:$V$1=\"A\",COLUMN($B$1:$V$1)),ROW(B10)))","v":{"$error":"#NUM!"}},{"$f":"INDEX($A$1:$V$5,4,SMALL(IF($B$1:$V$1=\"A\",COLUMN($B$1:$V$1)),ROW(C10)))","v":{"$error":"#NUM!"}},{"$f":"INDEX($A$1:$V$5,5,SMALL(IF($B$1:$V$1=\"A\",COLUMN($B$1:$V$1)),ROW(D10)))","v":{"$error":"#NUM!"}},{"$f":"TEXT(\"C\"&(IF(SMALL(IF($B$1:$V$1=\"C\",COLUMN($B$1:$V$1)),ROW(E10))=2,\"-1\",SMALL(IF($B$1:$V$1=\"C\",COLUMN($B$1:$V$1)),ROW(E10))-2)),\"000\")","v":{"$error":"#NUM!"}},{"$f":"INDEX($A$1:$V$5,3,SMALL(IF($B$1:$V$1=\"C\",COLUMN($B$1:$V$1)),ROW(E10)))","v":{"$error":"#NUM!"}},{"$f":"INDEX($A$1:$V$5,4,SMALL(IF($B$1:$V$1=\"C\",COLUMN($B$1:$V$1)),ROW(F10)))","v":{"$error":"#NUM!"}},{"$f":"INDEX($A$1:$V$5,5,SMALL(IF($B$1:$V$1=\"C\",COLUMN($B$1:$V$1)),ROW(G10)))","v":{"$error":"#NUM!"}},{"$error":"#NUM!"},{"$f":"排序!B11","v":"C16"},{"$f":"排序!C11","v":100},{"$f":"排序!D11","v":0},{"$f":"排序!E11","v":0},100]
[{"$f":"TEXT(\"A\"&(IF(SMALL(IF($B$1:$V$1=\"A\",COLUMN($B$1:$V$1)),ROW(A11))=2,\"-1\",SMALL(IF($B$1:$V$1=\"A\",COLUMN($B$1:$V$1)),ROW(A11))-2)),\"000\")","v":{"$error":"#NUM!"}},{"$f":"INDEX($A$1:$V$5,3,SMALL(IF($B$1:$V$1=\"A\",COLUMN($B$1:$V$1)),ROW(B11)))","v":{"$error":"#NUM!"}},{"$f":"INDEX($A$1:$V$5,4,SMALL(IF($B$1:$V$1=\"A\",COLUMN($B$1:$V$1)),ROW(C11)))","v":{"$error":"#NUM!"}},{"$f":"INDEX($A$1:$V$5,5,SMALL(IF($B$1:$V$1=\"A\",COLUMN($B$1:$V$1)),ROW(D11)))","v":{"$error":"#NUM!"}},{"$f":"TEXT(\"C\"&(IF(SMALL(IF($B$1:$V$1=\"C\",COLUMN($B$1:$V$1)),ROW(E11))=2,\"-1\",SMALL(IF($B$1:$V$1=\"C\",COLUMN($B$1:$V$1)),ROW(E11))-2)),\"000\")","v":{"$error":"#NUM!"}},{"$f":"INDEX($A$1:$V$5,3,SMALL(IF($B$1:$V$1=\"C\",COLUMN($B$1:$V$1)),ROW(E11)))","v":{"$error":"#NUM!"}},{"$f":"INDEX($A$1:$V$5,4,SMALL(IF($B$1:$V$1=\"C\",COLUMN($B$1:$V$1)),ROW(F11)))","v":{"$error":"#NUM!"}},{"$f":"INDEX($A$1:$V$5,5,SMALL(IF($B$1:$V$1=\"C\",COLUMN($B$1:$V$1)),ROW(G11)))","v":{"$error":"#NUM!"}},{"$error":"#NUM!"},{"$f":"排序!B12","v":"A20"},{"$f":"排序!C12","v":0.1},{"$f":"排序!D12","v":0},{"$f":"排序!E12","v":99.9},0.1]
[{"$f":"TEXT(\"A\"&(IF(SMALL(IF($B$1:$V$1=\"A\",COLUMN($B$1:$V$1)),ROW(A12))=2,\"-1\",SMALL(IF($B$1:$V$1=\"A\",COLUMN($B$1:$V$1)),ROW(A12))-2)),\"000\")","v":{"$error":"#NUM!"}},{"$f":"INDEX($A$1:$V$5,3,SMALL(IF($B$1:$V$1=\"A\",COLUMN($B$1:$V$1)),ROW(B12)))","v":{"$error":"#NUM!"}},{"$f":"INDEX($A$1:$V$5,4,SMALL(IF($B$1:$V$1=\"A\",COLUMN($B$1:$V$1)),ROW(C12)))","v":{"$error":"#NUM!"}},{"$f":"INDEX($A$1:$V$5,5,SMALL(IF($B$1:$V$1=\"A\",COLUMN($B$1:$V$1)),ROW(D12)))","v":{"$error":"#NUM!"}},{"$f":"TEXT(\"C\"&(IF(SMALL(IF($B$1:$V$1=\"C\",COLUMN($B$1:$V$1)),ROW(E12))=2,\"-1\",SMALL(IF($B$1:$V$1=\"C\",COLUMN($B$1:$V$1)),ROW(E12))-2)),\"000\")","v":{"$error":"#NUM!"}},{"$f":"INDEX($A$1:$V$5,3,SMALL(IF($B$1:$V$1=\"C\",COLUMN($B$1:$V$1)),ROW(E12)))","v":{"$error":"#NUM!"}},{"$f":"INDEX($A$1:$V$5,4,SMALL(IF($B$1:$V$1=\"C\",COLUMN($B$1:$V$1)),ROW(F12)))","v":{"$error":"#NUM!"}},{"$f":"INDEX($A$1:$V$5,5,SMALL(IF($B$1:$V$1=\"C\",COLUMN($B$1:$V$1)),ROW(G12)))","v":{"$error":"#NUM!"}},{"$error":"#NUM!"},{"$f":"排序!B13","v":{"$error":"#NUM!"}},{"$f":"排序!C13","v":{"$error":"#NUM!"}},{"$f":"排序!D13","v":{"$error":"#NUM!"}},{"$f":"排序!E13","v":{"$error":"#NUM!"}},{"$error":"#NUM!"}]
[{"$f":"TEXT(\"A\"&(IF(SMALL(IF($B$1:$V$1=\"A\",COLUMN($B$1:$V$1)),ROW(A13))=2,\"-1\",SMALL(IF($B$1:$V$1=\"A\",COLUMN($B$1:$V$1)),ROW(A13))-2)),\"000\")","v":{"$error":"#NUM!"}},{"$f":"INDEX($A$1:$V$5,3,SMALL(IF($B$1:$V$1=\"A\",COLUMN($B$1:$V$1)),ROW(B13)))","v":{"$error":"#NUM!"}},{"$f":"INDEX($A$1:$V$5,4,SMALL(IF($B$1:$V$1=\"A\",COLUMN($B$1:$V$1)),ROW(C13)))","v":{"$error":"#NUM!"}},{"$f":"INDEX($A$1:$V$5,5,SMALL(IF($B$1:$V$1=\"A\",COLUMN($B$1:$V$1)),ROW(D13)))","v":{"$error":"#NUM!"}},{"$f":"TEXT(\"C\"&(IF(SMALL(IF($B$1:$V$1=\"C\",COLUMN($B$1:$V$1)),ROW(E13))=2,\"-1\",SMALL(IF($B$1:$V$1=\"C\",COLUMN($B$1:$V$1)),ROW(E13))-2)),\"000\")","v":{"$error":"#NUM!"}},{"$f":"INDEX($A$1:$V$5,3,SMALL(IF($B$1:$V$1=\"C\",COLUMN($B$1:$V$1)),ROW(E13)))","v":{"$error":"#NUM!"}},{"$f":"INDEX($A$1:$V$5,4,SMALL(IF($B$1:$V$1=\"C\",COLUMN($B$1:$V$1)),ROW(F13)))","v":{"$error":"#NUM!"}},{"$f":"INDEX($A$1:$V$5,5,SMALL(IF($B$1:$V$1=\"C\",COLUMN($B$1:$V$1)),ROW(G13)))","v":{"$error":"#NUM!"}},{"$error":"#NUM!"},{"$f":"排序!B14","v":{"$error":"#NUM!"}},{"$f":"排序!C14","v":{"$error":"#NUM!"}},{"$f":"排序!D14","v":{"$error":"#NUM!"}},{"$f":"排序!E14","v":{"$error":"#NUM!"}},{"$error":"#NUM!"}]
{"$rows_left_out":19}
{"sheet":"Products","index":3,"n_rows":6,"n_cols":22,"rows_kept":6,"cut":false,"hidden":false,"merged":[]}
[null,-1,1,2,3,4,5,6,7,8,9,10,11,12,13,14,15,16,17,18,19,20]
[null,"G","T","G","C","C","C","A","G","A","C","T","G","A","G","C","A","C","G","T","G","A"]
["A",0,0,0,0,0,0,0,0,0,0,0.2,1,13.3,0,14.5,0,0,0.1,94.1,0.1,0]
["T",99.8,0,0,99.9,99.9,0,0,0,0,0,2,2.6,0.1,0.1,0,0,100,0,0,0,0.1]
["G",0,0,0,0,0,100,100,100,100,0,1.4,1.1000000000000001,86.5,99.9,85.5,0,0,99.9,5.9,99.9,0]
["C",0.2,100,100,0.1,0,0,0,0,0,100,96.3,95.3,0.1,0,0,100,0,0,0,0,99.9]

{"sheet":"排序","index":4,"n_rows":41,"n_cols":5,"rows_kept":41,"cut":false,"hidden":true,"merged":[]}
["serial","name","T","G","C"]
[{"$f":"VALUE(REPLACE(B2,1,1,\"\"))","v":3},{"$f":"Sequencing!E8","v":"C3"},{"$f":"Sequencing!F8","v":99.9},{"$f":"Sequencing!G8","v":0},{"$f":"Sequencing!H8","v":0.1}]
[{"$f":"VALUE(REPLACE(B3,1,1,\"\"))","v":4},{"$f":"Sequencing!E9","v":"C4"},{"$f":"Sequencing!F9","v":99.9},{"$f":"Sequencing!G9","v":0},{"$f":"Sequencing!H9","v":0}]
[{"$f":"VALUE(REPLACE(B4,1,1,\"\"))","v":5},{"$f":"Sequencing!E10","v":"C5"},{"$f":"Sequencing!F10","v":0},{"$f":"Sequencing!G10","v":100},{"$f":"Sequencing!H10","v":0}]
[{"$f":"VALUE(REPLACE(B5,1,1,\"\"))","v":6},{"$f":"Sequencing!A8","v":"A6"},{"$f":"Sequencing!B8","v":0},{"$f":"Sequencing!C8","v":100},{"$f":"Sequencing!D8","v":0}]
[{"$f":"VALUE(REPLACE(B6,1,1,\"\"))","v":8},{"$f":"Sequencing!A9","v":"A8"},{"$f":"Sequencing!B9","v":0},{"$f":"Sequencing!C9","v":100},{"$f":"Sequencing!D9","v":0}]
[{"$f":"VALUE(REPLACE(B7,1,1,\"\"))","v":9},{"$f":"Sequencing!E11","v":"C9"},{"$f":"Sequencing!F11","v":0},{"$f":"Sequencing!G11","v":0},{"$f":"Sequencing!H11","v":100}]
[{"$f":"VALUE(REPLACE(B8,1,1,\"\"))","v":12},{"$f":"Sequencing!A10","v":"A12"},{"$f":"Sequencing!B10","v":0.1},{"$f":"Sequencing!C10","v":86.5},{"$f":"Sequencing!D10","v":0.1}]
[{"$f":"VALUE(REPLACE(B9,1,1,\"\"))","v":14},{"$f":"Sequencing!E12","v":"C14"},{"$f":"Sequencing!F12","v":0},{"$f":"Sequencing!G12","v":85.5},{"$f":"Sequencing!H12","v":0}]
[{"$f":"VALUE(REPLACE(B10,1,1,\"\"))","v":15},{"$f":"Sequencing!A11","v":"A15"},{"$f":"Sequencing!B11","v":0},{"$f":"Sequencing!C11","v":0},{"$f":"Sequencing!D11","v":100}]
[{"$f":"VALUE(REPLACE(B11,1,1,\"\"))","v":16},{"$f":"Sequencing!E13","v":"C16"},{"$f":"Sequencing!F13","v":100},{"$f":"Sequencing!G13","v":0},{"$f":"Sequencing!H13","v":0}]
[{"$f":"VALUE(REPLACE(B12,1,1,\"\"))","v":20},{"$f":"Sequencing!A12","v":"A20"},{"$f":"Sequencing!B12","v":0.1},{"$f":"Sequencing!C12","v":0},{"$f":"Sequencing!D12","v":99.9}]
[{"$f":"VALUE(REPLACE(B13,1,1,\"\"))","v":{"$error":"#NUM!"}},{"$f":"Sequencing!E14","v":{"$error":"#NUM!"}},{"$f":"Sequencing!F14","v":{"$error":"#NUM!"}},{"$f":"Sequencing!G14","v":{"$error":"#NUM!"}},{"$f":"Sequencing!H14","v":{"$error":"#NUM!"}}]
[{"$f":"VALUE(REPLACE(B14,1,1,\"\"))","v":{"$error":"#NUM!"}},{"$f":"Sequencing!E15","v":{"$error":"#NUM!"}},{"$f":"Sequencing!F15","v":{"$error":"#NUM!"}},{"$f":"Sequencing!G15","v":{"$error":"#NUM!"}},{"$f":"Sequencing!H15","v":{"$error":"#NUM!"}}]
[{"$f":"VALUE(REPLACE(B15,1,1,\"\"))","v":{"$error":"#NUM!"}},{"$f":"Sequencing!E16","v":{"$error":"#NUM!"}},{"$f":"Sequencing!F16","v":{"$error":"#NUM!"}},{"$f":"Sequencing!G16","v":{"$error":"#NUM!"}},{"$f":"Sequencing!H16","v":{"$error":"#NUM!"}}]
[{"$f":"VALUE(REPLACE(B16,1,1,\"\"))","v":{"$error":"#NUM!"}},{"$f":"Sequencing!E17","v":{"$error":"#NUM!"}},{"$f":"Sequencing!F17","v":{"$error":"#NUM!"}},{"$f":"Sequencing!G17","v":{"$error":"#NUM!"}},{"$f":"Sequencing!H17","v":{"$error":"#NUM!"}}]
[{"$f":"VALUE(REPLACE(B17,1,1,\"\"))","v":{"$error":"#NUM!"}},{"$f":"Sequencing!E18","v":{"$error":"#NUM!"}},{"$f":"Sequencing!F18","v":{"$error":"#NUM!"}},{"$f":"Sequencing!G18","v":{"$error":"#NUM!"}},{"$f":"Sequencing!H18","v":{"$error":"#NUM!"}}]
[{"$f":"VALUE(REPLACE(B18,1,1,\"\"))","v":{"$error":"#NUM!"}},{"$f":"Sequencing!E19","v":{"$error":"#NUM!"}},{"$f":"Sequencing!F19","v":{"$error":"#NUM!"}},{"$f":"Sequencing!G19","v":{"$error":"#NUM!"}},{"$f":"Sequencing!H19","v":{"$error":"#NUM!"}}]
[{"$f":"VALUE(REPLACE(B19,1,1,\"\"))","v":{"$error":"#NUM!"}},{"$f":"Sequencing!E20","v":{"$error":"#NUM!"}},{"$f":"Sequencing!F20","v":{"$error":"#NUM!"}},{"$f":"Sequencing!G20","v":{"$error":"#NUM!"}},{"$f":"Sequencing!H20","v":{"$error":"#NUM!"}}]
[{"$f":"VALUE(REPLACE(B20,1,1,\"\"))","v":{"$error":"#NUM!"}},{"$f":"Sequencing!E21","v":{"$error":"#NUM!"}},{"$f":"Sequencing!F21","v":{"$error":"#NUM!"}},{"$f":"Sequencing!G21","v":{"$error":"#NUM!"}},{"$f":"Sequencing!H21","v":{"$error":"#NUM!"}}]
{"$rows_left_out":21}